今天打开IDE自动更新就出现问题了(Linux上)



  • 如题,更新之后编译之前的工程编译不成功。
    [ INFO] /home/wenhan/k210/KendryteIDE/LocalPackage/toolchain/bin/../libexec/gcc/riscv64-unknown-elf/8.2.0/cc1: error while loading shared libraries: libisl.so.19: cannot open shared object file: No such file or directory
    [ INFO] /home/wenhan/k210/KendryteIDE/LocalPackage/toolchain/bin/../libexec/gcc/riscv64-unknown-elf/8.2.0/cc1: error while loading shared libraries: libisl.so.19: cannot open shared object file: No such file or directory
    [ INFO] /home/wenhan/k210/KendryteIDE/LocalPackage/toolchain/bin/../libexec/gcc/riscv64-unknown-elf/8.2.0/cc1: error while loading shared libraries: libisl.so.19: cannot open shared object file: No such file or directory
    [ INFO] kendryte-standalone-sdk/CMakeFiles/kendryte-standalone-sdk.dir/build.make:88: recipe for target 'kendryte-standalone-sdk/CMakeFiles/kendryte-standalone-sdk.dir/lib/bsp/entry_user.c.obj' failed
    [ INFO] make[2]: *** [kendryte-standalone-sdk/CMakeFiles/kendryte-standalone-sdk.dir/lib/bsp/entry_user.c.obj] Error 1
    [ INFO] make[2]: *** 正在等待未完成的任务....
    [ INFO] make[2]: *** [kendryte-standalone-sdk/CMakeFiles/kendryte-standalone-sdk.dir/lib/bsp/entry.c.obj] Error 1
    [ INFO] make[2]: *** [kendryte-standalone-sdk/CMakeFiles/kendryte-standalone-sdk.dir/lib/bsp/crt.S.obj] Error 1
    [ INFO] make[1]: *** [kendryte-standalone-sdk/CMakeFiles/kendryte-standalone-sdk.dir/all] Error 2
    [ INFO] kendryte-standalone-sdk/CMakeFiles/kendryte-standalone-sdk.dir/build.make:75: recipe for target 'kendryte-standalone-sdk/CMakeFiles/kendryte-standalone-sdk.dir/lib/bsp/entry.c.obj' failed
    [ INFO] kendryte-standalone-sdk/CMakeFiles/kendryte-standalone-sdk.dir/build.make:62: recipe for target 'kendryte-standalone-sdk/CMakeFiles/kendryte-standalone-sdk.dir/lib/bsp/crt.S.obj' failed
    [ INFO] CMakeFiles/Makefile2:127: recipe for target 'kendryte-standalone-sdk/CMakeFiles/kendryte-standalone-sdk.dir/all' failed
    [ INFO] Makefile:83: recipe for target 'all' failed
    [ INFO] make: *** [all] Error 2
    [ INFO]
    [ INFO] Build Error: /home/wenhan/k210/KendryteIDE/LocalPackage/cmake/bin/cmake exited with code 2.



  • @GongT 我直接在ubunutu上下载的是你们的工具链,我看那儿本身存在这个so文件,可是为啥还给这个提示呢?



  • @GongT said in 今天打开IDE自动更新就出现问题了(Linux上):

    libisl.so.19

    安装一下也可以,或者找到这两个问题件拷贝到工具链的lib下也可以



  • @585858 @wenhan

    安装 libisl.so.19 和 libmpfr.so.6

    Fedora/RHEL用 dnf provides */libisl.so.19 然后 dnf install 找到的包名
    CentOS把上面的dnf改成yum

    Ubuntu用apt-get,具体用法可以搜一下(



  • [  2%] Building C object lib/CMakeFiles/kendryte.dir/bsp/crt.S.obj
    /home/xw/work/kendryte/kendryte-toolchain/bin/../libexec/gcc/riscv64-unknown-elf/8.2.0/cc1: error while loading shared libraries: libmpfr.so.6: cannot open shared object file: No such file or directory
    lib/CMakeFiles/kendryte.dir/build.make:62: recipe for target 'lib/CMakeFiles/kendryte.dir/bsp/crt.S.obj' failed
    make[2]: *** [lib/CMakeFiles/kendryte.dir/bsp/crt.S.obj] Error 1
    CMakeFiles/Makefile2:127: recipe for target 'lib/CMakeFiles/kendryte.dir/all' failed
    make[1]: *** [lib/CMakeFiles/kendryte.dir/all] Error 2
    Makefile:83: recipe for target 'all' failed
    make: *** [all] Error 2
    


  • 同问,我也产生了这个错误
    用IDE和命令行都报这个错误